Reaction Details
TargetHypoxia-inducible factor 1-alpha
LigandBDBM50346792
Substrate/Competitorn/a
Meas. Tech.ChEMBL_753564 (CHEMBL1799182)
IC50 490±n/a nM
Citation Xia, YJin, YKaur, NChoi, YLee, K HIF-1a inhibitors: synthesis and biological evaluation of novel moracin O and P analogues. Eur J Med Chem46:2386-96 (2011) 
 
Hypoxia-inducible factor 1-alpha
Name:Hypoxia-inducible factor 1-alpha
Type:Protein
Mol. Mass.:92647.24
Organism:Homo sapiens (Human)
Description:Q16665
Residue:826
BDBM50346792
NameBDBM50346792
Synonyms:CHEMBL1795437
TypeSmall organic molecule
Emp. Form.C26H24O4
Mol. Mass.400.4664
SMILESCC(C)(O)C1Cc2cc3cc(oc3cc2O1)-c1ccc(OCc2ccccc2)cc1