Reaction Details
TargetHypoxia-inducible factor 1-alpha
LigandBDBM50346783
Substrate/Competitorn/a
Meas. Tech.ChEMBL_753564 (CHEMBL1799182)
IC50 4.2±n/a nM
Citation Xia, YJin, YKaur, NChoi, YLee, K HIF-1a inhibitors: synthesis and biological evaluation of novel moracin O and P analogues. Eur J Med Chem46:2386-96 (2011) 
 
Hypoxia-inducible factor 1-alpha
Name:Hypoxia-inducible factor 1-alpha
Type:Protein
Mol. Mass.:92647.24
Organism:Homo sapiens (Human)
Description:Q16665
Residue:826
BDBM50346783
NameBDBM50346783
Synonyms:CHEMBL1795446
TypeSmall organic molecule
Emp. Form.C19H18O4
Mol. Mass.310.3438
SMILESCC(C)(O)[C@H]1Cc2cc3cc(oc3cc2O1)-c1ccc(O)cc1