Reaction Details
TargetHypoxia-inducible factor 1-alpha
LigandBDBM50346795
Substrate/Competitorn/a
Meas. Tech.ChEMBL_753564 (CHEMBL1799182)
IC50 10±n/a nM
Citation Xia, YJin, YKaur, NChoi, YLee, K HIF-1a inhibitors: synthesis and biological evaluation of novel moracin O and P analogues. Eur J Med Chem46:2386-96 (2011) 
 
Hypoxia-inducible factor 1-alpha
Name:Hypoxia-inducible factor 1-alpha
Type:Protein
Mol. Mass.:92647.24
Organism:Homo sapiens (Human)
Description:Q16665
Residue:826
BDBM50346795
NameBDBM50346795
Synonyms:CHEMBL1795433
TypeSmall organic molecule
Emp. Form.C21H22O5
Mol. Mass.354.3964
SMILESCOc1cc(OC)cc(c1)-c1cc2cc3CC(Oc3cc2o1)C(C)(C)O