Reaction Details
TargetMatrix metalloproteinase-14
LigandBDBM50346803
Substrate/Competitorn/a
Meas. Tech.ChEMBL_753771 (CHEMBL1799652)
IC50 112±n/a nM
Citation Nuti, ECasalini, FSantamaria, SGabelloni, PBendinelli, SDa Pozzo, ECosta, BMarinelli, LLa Pietra, VNovellino, EMargarida Bernardo, MFridman, RDa Settimo, FMartini, CRossello, A Synthesis and biological evaluation in U87MG glioma cells of (ethynylthiophene)sulfonamido-based hydroxamates as matrix metalloproteinase inhibitors. Eur J Med Chem46:2617-29 (2011) 
 
Matrix metalloproteinase-14
Name:Matrix metalloproteinase-14
Type:Protein
Mol. Mass.:65900.19
Organism:Homo sapiens (Human)
Description:P50281
Residue:582
BDBM50346803
NameBDBM50346803
Synonyms:CHEMBL1795862
TypeSmall organic molecule
Emp. Form.C26H26N2O4S2
Mol. Mass.494.626
SMILESCCCCc1ccc(cc1)C#Cc1ccc(s1)S(=O)(=O)N1Cc2ccccc2C[C@@H]1C(=O)NO