Reaction Details
Target72 kDa type IV collagenase
LigandBDBM50346799
Substrate/Competitorn/a
Meas. Tech.ChEMBL_753767 (CHEMBL1799648)
IC50 4±n/a nM
Citation Nuti, ECasalini, FSantamaria, SGabelloni, PBendinelli, SDa Pozzo, ECosta, BMarinelli, LLa Pietra, VNovellino, EMargarida Bernardo, MFridman, RDa Settimo, FMartini, CRossello, A Synthesis and biological evaluation in U87MG glioma cells of (ethynylthiophene)sulfonamido-based hydroxamates as matrix metalloproteinase inhibitors. Eur J Med Chem46:2617-29 (2011) 
 
72 kDa type IV collagenase
Name:72 kDa type IV collagenase
Type:Enzyme
Mol. Mass.:73870.36
Organism:Homo sapiens (Human)
Description: P08253
Residue:660
BDBM50346799
NameBDBM50346799
Synonyms:CHEMBL1795858
TypeSmall organic molecule
Emp. Form.C32H30N2O5S2
Mol. Mass.586.721
SMILESCCCCc1ccc(cc1)C#Cc1ccc(s1)S(=O)(=O)N[C@H](Cc1ccc(cc1)C(=O)c1ccccc1)C(=O)NO