Reaction Details
TargetCalmodulin-1
LigandBDBM50346813
Substrate/Competitorn/a
Meas. Tech.ChEMBL_753876 (CHEMBL1798138)
IC50 56150±n/a nM
Citation Reyes-Ramírez, ALeyte-Lugo, MFigueroa, MSerrano-Alba, TGonzález-Andrade, MMata, R Synthesis, biological evaluation, and docking studies of gigantol analogs as calmodulin inhibitors. Eur J Med Chem46:2699-708 (2011) 
 
Calmodulin-1
Name:Calmodulin-1
Type:Protein
Mol. Mass.:16813.73
Organism:Human
Description:P0DP23
Residue:149
BDBM50346813
NameBDBM50346813
Synonyms:CHEMBL1796020
TypeSmall organic molecule
Emp. Form.C16H18O4
Mol. Mass.274.3117
SMILESCOc1cc(Cc2cccc(OC)c2O)cc(OC)c1