Reaction Details
TargetCholinesterase
LigandBDBM50346858
Substrate/Competitorn/a
Meas. Tech.ChEMBL_753890 (CHEMBL1798234)
IC50 16400±n/a nM
Citation Macabeo, APVidar, WSChen, XDecker, MHeilmann, JWan, BFranzblau, SGGalvez, EVAguinaldo, MACordell, GA Mycobacterium tuberculosis and cholinesterase inhibitors from Voacanga globosa. Eur J Med Chem46:3118-23 (2011) 
 
Cholinesterase
Name:Cholinesterase
Type:Enzyme
Mol. Mass.:65643.35
Organism:Equus caballus (Horse)
Description:P81908
Residue:574
BDBM50346858
NameBDBM50346858
Synonyms:CHEMBL1797183
TypeSmall organic molecule
Emp. Form.C43H48N4O7
Mol. Mass.732.8638
SMILESCOC(=O)C1C[C@]23CCO[C@H]2[C@@]2(C[C@@H]4C[C@]56CC(=O)O[C@H]5CCN5CC[C@]7([C@H]4N(C2)c2c7cccc2OC)[C@H]65)[C@@H](O)N2CC[C@@]4([C@H]32)C1=Nc1ccccc41