Reaction Details
TargetCholinesterase
LigandBDBM10404
Substrate/Competitorn/a
Meas. Tech.ChEMBL_753890 (CHEMBL1798234)
IC50 8400±n/a nM
Citation Macabeo, APVidar, WSChen, XDecker, MHeilmann, JWan, BFranzblau, SGGalvez, EVAguinaldo, MACordell, GA Mycobacterium tuberculosis and cholinesterase inhibitors from Voacanga globosa. Eur J Med Chem46:3118-23 (2011) 
 
Cholinesterase
Name:Cholinesterase
Type:Enzyme
Mol. Mass.:65643.35
Organism:Equus caballus (Horse)
Description:P81908
Residue:574
BDBM10404
NameBDBM10404
Synonyms:(1S,12S,14R)-9-methoxy-4-methyl-11-oxa-4-azatetracyclo[8.6.1.0^{1,12}.0^{6,17}]heptadeca-6,8,10(17),15-tetraen-14-ol GALANTAMINE HYDROBROMIDE Galanthamine Lycoremine Nivaline Reminyl US9586925, Galantamine | galantamine
TypeSmall organic molecule
Emp. Form.C17H21NO3
Mol. Mass.287.3535
SMILESCOc1ccc2CN(C)CC[C@@]34C=C[C@H](O)C[C@@H]3Oc1c24