Reaction Details
TargetLysine-specific histone demethylase 1A
LigandBDBM50346868
Substrate/Competitorn/a
Meas. Tech.ChEMBL_754085 (CHEMBL1798563)
Ki 1500±n/a nM
Citation Lohse, BKristensen, JLKristensen, LHAgger, KHelin, KGajhede, MClausen, RP Inhibitors of histone demethylases. Bioorg Med Chem19:3625-36 (2011) 
 
Lysine-specific histone demethylase 1A
Name:Lysine-specific histone demethylase 1A
Type:Enzyme
Mol. Mass.:92901.01
Organism:Homo sapiens (Human)
Description:O60341
Residue:852
BDBM50346868
NameBDBM50346868
Synonyms:CHEMBL1797645 | S2111
TypeSmall organic molecule
Emp. Form.C18H19F2NO
Mol. Mass.303.3464
SMILESCCc1cccc(COc2c(F)cc(F)cc2C2CC2N)c1