Reaction Details
TargetHypoxia-inducible factor 1-alpha inhibitor
LigandBDBM26106
Substrate/Competitorn/a
Meas. Tech.ChEMBL_754093 (CHEMBL1798571)
Ki 1200000±n/a nM
Citation Lohse, BKristensen, JLKristensen, LHAgger, KHelin, KGajhede, MClausen, RP Inhibitors of histone demethylases. Bioorg Med Chem19:3625-36 (2011) 
 
Hypoxia-inducible factor 1-alpha inhibitor
Name:Hypoxia-inducible factor 1-alpha inhibitor
Type:Enzyme
Mol. Mass.:40278.92
Organism:Homo sapiens (Human)
Description:Q9NWT6
Residue:349
BDBM26106
NameBDBM26106
Synonyms:CHEMBL90852 NOG [(carboxymethyl)carbamoyl]formic acid
TypeSmall organic molecule
Emp. Form.C4H5NO5
Mol. Mass.147.0862
SMILESOC(=O)CNC(=O)C(O)=O