Reaction Details
TargetLysine-specific demethylase 4E
LigandBDBM50306580
Substrate/Competitorn/a
Meas. Tech.ChEMBL_754090 (CHEMBL1798568)
IC50 5400±n/a nM
Citation Lohse, BKristensen, JLKristensen, LHAgger, KHelin, KGajhede, MClausen, RP Inhibitors of histone demethylases. Bioorg Med Chem19:3625-36 (2011) 
 
Lysine-specific demethylase 4E
Name:Lysine-specific demethylase 4E
Type:Enzyme
Mol. Mass.:56815.71
Organism:Homo sapiens (Human)
Description:B2RXH2
Residue:506
BDBM50306580
NameBDBM50306580
Synonyms:(R)-3-(4-(4-bromophenylsulfonyloxy)phenyl)-2-(carboxyformamido)propanoic acid | CHEMBL602503
TypeSmall organic molecule
Emp. Form.C17H14BrNO8S
Mol. Mass.472.264
SMILESOC(=O)[C@@H](Cc1ccc(OS(=O)(=O)c2ccc(Br)cc2)cc1)NC(=O)C(O)=O