Reaction Details
TargetLysine-specific demethylase 4E
LigandBDBM60917
Substrate/Competitorn/a
Meas. Tech.ChEMBL_754089 (CHEMBL1798567)
Ki 1920±n/a nM
Citation Lohse, BKristensen, JLKristensen, LHAgger, KHelin, KGajhede, MClausen, RP Inhibitors of histone demethylases. Bioorg Med Chem19:3625-36 (2011) 
 
Lysine-specific demethylase 4E
Name:Lysine-specific demethylase 4E
Type:Enzyme
Mol. Mass.:56815.71
Organism:Homo sapiens (Human)
Description:B2RXH2
Residue:506
BDBM60917
NameBDBM60917
Synonyms:9-chloranyl-5-(4-hydroxyphenyl)-2,3,4,5-tetrahydro-1H-3-benzazepine-7,8-diol;methanesulfonic acid 9-chloro-5-(4-hydroxyphenyl)-2,3,4,5-tetrahydro-1H-3-benzazepine-7,8-diol;methanesulfonic acid FENOLDOPAM MESYLATE SMR000469190 | cid_49659
TypeSmall organic molecule
Emp. Form.C16H16ClNO3
Mol. Mass.305.756
SMILESOc1ccc(cc1)C1CNCCc2c(Cl)c(O)c(O)cc12