Reaction Details
TargetEndoglucanase-5
LigandBDBM50346885
Substrate/Competitorn/a
Meas. Tech.ChEMBL_754100 (CHEMBL1798578)
pH3±n/a
Ki 25000000±n/a nM
Commentsextracted
Citation Noguchi, STakemoto, SKidokoro, SYamamoto, KHashimoto, M Syntheses of cellotriose and cellotetraose analogues as transition state mimics for mechanistic studies of cellulases. Bioorg Med Chem19:3812-30 (2011) 
 
Endoglucanase-5
Name:Endoglucanase-5
Type:PROTEIN
Mol. Mass.:22862.67
Organism:Humicola insolens
Description:ChEMBL_754101
Residue:213
BDBM50346885
NameBDBM50346885
Synonyms:CHEMBL1797812
TypeSmall organic molecule
Emp. Form.C20H34O14S
Mol. Mass.530.541
SMILESCO[C@H]1O[C@H](CO)[C@@H](S[C@@H]2C=C(CO)[C@@H](O[C@@H]3O[C@H](CO)[C@@H](O)[C@H](O)[C@H]3O)[C@H](O)[C@H]2O)[C@H](O)[C@H]1O