Reaction Details
TargetEpidermal growth factor receptor
LigandBDBM50346918
Substrate/Competitorn/a
Meas. Tech.ChEMBL_752898 (CHEMBL1798632)
IC50>10000±n/a nM
Citation Devadas, BSelness, SRXing, LMadsen, HMMarrufo, LDShieh, HMessing, DMYang, JZMorgan, HMAnderson, GDWebb, EGZhang, JDevraj, RVMonahan, JB Substituted N-aryl-6-pyrimidinones: a new class of potent, selective, and orally active p38 MAP kinase inhibitors. Bioorg Med Chem Lett21:3856-60 (2011) 
 
Epidermal growth factor receptor
Name:Epidermal growth factor receptor
Type:Receptor Kinase Domain
Mol. Mass.:134279.59
Organism:Homo sapiens (Human)
Description:P00533
Residue:1210
BDBM50346918
NameBDBM50346918
Synonyms:CHEMBL1738710
TypeSmall organic molecule
Emp. Form.C21H18ClF2N3O4
Mol. Mass.449.835
SMILESCc1ccc(cc1-n1cnc(OCc2ccc(F)cc2F)c(Cl)c1=O)C(=O)NCCO