Reaction Details
TargetSerine/threonine-protein kinase 3
LigandBDBM50346918
Substrate/Competitorn/a
Meas. Tech.ChEMBL_753062 (CHEMBL1798990)
IC50>10000±n/a nM
Citation Devadas, BSelness, SRXing, LMadsen, HMMarrufo, LDShieh, HMessing, DMYang, JZMorgan, HMAnderson, GDWebb, EGZhang, JDevraj, RVMonahan, JB Substituted N-aryl-6-pyrimidinones: a new class of potent, selective, and orally active p38 MAP kinase inhibitors. Bioorg Med Chem Lett21:3856-60 (2011) 
 
Serine/threonine-protein kinase 3
Name:Serine/threonine-protein kinase 3
Type:Serine/threonine-protein kinase
Mol. Mass.:56284.87
Organism:Homo sapiens (Human)
Description:n/a
Residue:491
BDBM50346918
NameBDBM50346918
Synonyms:CHEMBL1738710
TypeSmall organic molecule
Emp. Form.C21H18ClF2N3O4
Mol. Mass.449.835
SMILESCc1ccc(cc1-n1cnc(OCc2ccc(F)cc2F)c(Cl)c1=O)C(=O)NCCO