Reaction Details
TargetMembrane-associated tyrosine- and threonine-specific cdc2-inhibitory kinase
LigandBDBM50346918
Substrate/Competitorn/a
Meas. Tech.ChEMBL_753068 (CHEMBL1798996)
IC50>10000±n/a nM
Citation Devadas, BSelness, SRXing, LMadsen, HMMarrufo, LDShieh, HMessing, DMYang, JZMorgan, HMAnderson, GDWebb, EGZhang, JDevraj, RVMonahan, JB Substituted N-aryl-6-pyrimidinones: a new class of potent, selective, and orally active p38 MAP kinase inhibitors. Bioorg Med Chem Lett21:3856-60 (2011) 
 
Membrane-associated tyrosine- and threonine-specific cdc2-inhibitory kinase
Name:Membrane-associated tyrosine- and threonine-specific cdc2-inhibitory kinase
Type:PROTEIN
Mol. Mass.:54523.76
Organism:Homo sapiens (Human)
Description:ChEMBL_587209
Residue:499
BDBM50346918
NameBDBM50346918
Synonyms:CHEMBL1738710
TypeSmall organic molecule
Emp. Form.C21H18ClF2N3O4
Mol. Mass.449.835
SMILESCc1ccc(cc1-n1cnc(OCc2ccc(F)cc2F)c(Cl)c1=O)C(=O)NCCO