Reaction Details
TargetCarbonic anhydrase 7
LigandBDBM10881
Substrate/Competitorn/a
Meas. Tech.ChEMBL_753080 (CHEMBL1799008)
Ki 2.1±n/a nM
Citation Biswas, SAggarwal, MGüzel, ÖScozzafava, AMcKenna, RSupuran, CT Conformational variability of different sulfonamide inhibitors with thienyl-acetamido moieties attributes to differential binding in the active site of cytosolic human carbonic anhydrase isoforms. Bioorg Med Chem19:3732-8 (2011) 
 
Carbonic anhydrase 7
Name:Carbonic anhydrase 7
Type:Enzyme
Mol. Mass.:29664.11
Organism:Homo sapiens (Human)
Description:Human cloned isozyme.
Residue:264
BDBM10881
NameBDBM10881
Synonyms:CHEMBL288100 Methazolamide Methazolamide, MZA Sulfonamide, 2 sulfonamide 2
TypeSmall organic molecule
Emp. Form.C5H8N4O3S2
Mol. Mass.236.272
SMILESCC(=O)N=c1sc(nn1C)S(N)(=O)=O