Reaction Details
TargetCarbonic anhydrase 13
LigandBDBM35726
Substrate/Competitorn/a
Meas. Tech.ChEMBL_753081 (CHEMBL1799009)
Ki 125±n/a nM
Citation Biswas, SAggarwal, MGüzel, ÖScozzafava, AMcKenna, RSupuran, CT Conformational variability of different sulfonamide inhibitors with thienyl-acetamido moieties attributes to differential binding in the active site of cytosolic human carbonic anhydrase isoforms. Bioorg Med Chem19:3732-8 (2011) 
 
Carbonic anhydrase 13
Name:Carbonic anhydrase 13
Type:Enzyme
Mol. Mass.:29445.78
Organism:Homo sapiens (Human)
Description:Q8N1Q1
Residue:262
BDBM35726
NameBDBM35726
Synonyms:sulfonamide deriv., 5a
TypeSmall organic molecule
Emp. Form.C12H12N2O3S2
Mol. Mass.296.365
SMILESNS(=O)(=O)c1ccc(NC(=O)Cc2cccs2)cc1