Reaction Details
TargetCarbonic anhydrase 13
LigandBDBM35727
Substrate/Competitorn/a
Meas. Tech.ChEMBL_753081 (CHEMBL1799009)
Ki 437±n/a nM
Citation Biswas, SAggarwal, MGüzel, ÖScozzafava, AMcKenna, RSupuran, CT Conformational variability of different sulfonamide inhibitors with thienyl-acetamido moieties attributes to differential binding in the active site of cytosolic human carbonic anhydrase isoforms. Bioorg Med Chem19:3732-8 (2011) 
 
Carbonic anhydrase 13
Name:Carbonic anhydrase 13
Type:Enzyme
Mol. Mass.:29445.78
Organism:Homo sapiens (Human)
Description:Q8N1Q1
Residue:262
BDBM35727
NameBDBM35727
Synonyms:sulfonamide deriv., 5b
TypeSmall organic molecule
Emp. Form.C12H11FN2O3S2
Mol. Mass.314.356
SMILESNS(=O)(=O)c1ccc(NC(=O)Cc2cccs2)c(F)c1