Reaction Details
TargetRenin
LigandBDBM50347017
Substrate/Competitorn/a
Meas. Tech.ChEMBL_753402 (CHEMBL1799737)
IC50 0.120000±n/a nM
Citation Chen, ACampeau, LCCauchon, EChefson, ADucharme, YDubé, DFalgueyret, JPFournier, PAGagné, SGrimm, EHan, YHoule, RHuang, JQLacombe, PLaliberté, SLévesque, JFLiu, SMacDonald, DMackay, BMcKay, DPercival, MDRegan, CRegan, HSt-Jacques, RToulmond, S Renin inhibitors for the treatment of hypertension: design and optimization of a novel series of pyridone-substituted piperidines. Bioorg Med Chem Lett21:3970-5 (2011) 
 
Renin
Name:Renin
Type:Enzyme
Mol. Mass.:45058.99
Organism:Homo sapiens (Human)
Description:n/a
Residue:406
BDBM50347017
NameBDBM50347017
Synonyms:CHEMBL1796070
TypeSmall organic molecule
Emp. Form.C28H35ClN4O3
Mol. Mass.511.055
SMILESCOCCCn1cc(CN(C2CC2)C(=O)[C@H]2CNCC[C@@H]2c2ccn(C)c(=O)c2)c2c(Cl)cccc12