Reaction Details
TargetPotassium voltage-gated channel subfamily H member 2
LigandBDBM50346988
Substrate/Competitorn/a
Meas. Tech.ChEMBL_753404 (CHEMBL1799739)
Ki 1200±n/a nM
Citation Chen, ACampeau, LCCauchon, EChefson, ADucharme, YDubé, DFalgueyret, JPFournier, PAGagné, SGrimm, EHan, YHoule, RHuang, JQLacombe, PLaliberté, SLévesque, JFLiu, SMacDonald, DMackay, BMcKay, DPercival, MDRegan, CRegan, HSt-Jacques, RToulmond, S Renin inhibitors for the treatment of hypertension: design and optimization of a novel series of pyridone-substituted piperidines. Bioorg Med Chem Lett21:3970-5 (2011) 
 
Potassium voltage-gated channel subfamily H member 2
Name:Potassium voltage-gated channel subfamily H member 2
Type:Multi-pass membrane protein
Mol. Mass.:126672.65
Organism:Homo sapiens (Human)
Description:Q12809
Residue:1159
BDBM50346988
NameBDBM50346988
Synonyms:CHEMBL1796074
TypeSmall organic molecule
Emp. Form.C31H32F2N4O2
Mol. Mass.530.6082
SMILESCn1ccc(cc1=O)[C@H]1CCNC[C@@H]1C(=O)N(Cc1cn(Cc2cccc(F)c2)c2cccc(F)c12)C1CC1