Reaction Details
TargetPotassium voltage-gated channel subfamily H member 2
LigandBDBM50347013
Substrate/Competitorn/a
Meas. Tech.ChEMBL_753404 (CHEMBL1799739)
Ki>29000±n/a nM
Citation Chen, ACampeau, LCCauchon, EChefson, ADucharme, YDubé, DFalgueyret, JPFournier, PAGagné, SGrimm, EHan, YHoule, RHuang, JQLacombe, PLaliberté, SLévesque, JFLiu, SMacDonald, DMackay, BMcKay, DPercival, MDRegan, CRegan, HSt-Jacques, RToulmond, S Renin inhibitors for the treatment of hypertension: design and optimization of a novel series of pyridone-substituted piperidines. Bioorg Med Chem Lett21:3970-5 (2011) 
 
Potassium voltage-gated channel subfamily H member 2
Name:Potassium voltage-gated channel subfamily H member 2
Type:Multi-pass membrane protein
Mol. Mass.:126672.65
Organism:Homo sapiens (Human)
Description:Q12809
Residue:1159
BDBM50347013
NameBDBM50347013
Synonyms:CHEMBL1796066
TypeSmall organic molecule
Emp. Form.C29H36N4O3
Mol. Mass.488.6211
SMILESCOCCCc1cc(CN(C2CC2)C(=O)[C@H]2CNCC[C@@H]2c2ccn(C)c(=O)c2)c2ccccc2n1