Reaction Details
TargetDNA-dependent protein kinase catalytic subunit
LigandBDBM50347196
Substrate/Competitorn/a
Meas. Tech.ChEMBL_754403 (CHEMBL1799366)
IC50 1700±n/a nM
Citation Ihmaid, SAl-Rawi, JBradley, CAngove, MJRobertson, MNClark, RL Synthesis, structural elucidation, DNA-PK inhibition, homology modelling and anti-platelet activity of morpholino-substituted-1,3-naphth-oxazines. Bioorg Med Chem19:3983-94 (2011) 
 
DNA-dependent protein kinase catalytic subunit
Name:DNA-dependent protein kinase catalytic subunit
Type:Protein
Mol. Mass.:469114.78
Organism:Homo sapiens (Human)
Description:P78527
Residue:4128
BDBM50347196
NameBDBM50347196
Synonyms:CHEMBL1795748
TypeSmall organic molecule
Emp. Form.C22H19N3O4
Mol. Mass.389.404
SMILESO=c1nc(oc2cc3ccc(OCc4cccnc4)cc3cc12)N1CCOCC1