Reaction Details
TargetPerforin-1
LigandBDBM50275059
Substrate/Competitorn/a
Meas. Tech.ChEMBL_754405 (CHEMBL1799368)
IC50 970±n/a nM
Citation Lyons, DMHuttunen, KMBrowne, KACiccone, ATrapani, JADenny, WASpicer, JA Inhibition of the cellular function of perforin by 1-amino-2,4-dicyanopyrido[1,2-a]benzimidazoles. Bioorg Med Chem19:4091-100 (2011) 
 
Perforin-1
Name:Perforin-1
Type:PROTEIN
Mol. Mass.:61392.32
Organism:Homo sapiens (Human)
Description:ChEMBL_1285138
Residue:555
BDBM50275059
NameBDBM50275059
Synonyms:(Z)-1-(Benzo[b]thiophen-3-ylmethylene)-6-methyl-4-thioxo-4,5-dihydrofuro[3,4-c]pyridin-3(1H)-one | CHEMBL463187
TypeSmall organic molecule
Emp. Form.C17H11NO2S2
Mol. Mass.325.405
SMILESCc1cc2\C(OC(=O)c2c(=S)[nH]1)=C\c1csc2ccccc12