Reaction Details
TargetL-cysteine:1D-myo-inositol 2-amino-2-deoxy-alpha-D-glucopyranoside ligase
LigandBDBM50347261
Substrate/Competitorn/a
Meas. Tech.ChEMBL_754210 (CHEMBL1798854)
IC50 130000±n/a nM
Citation Newton, GLBuchmeier, NLa Clair, JJFahey, RC Evaluation of NTF1836 as an inhibitor of the mycothiol biosynthetic enzyme MshC in growing and non-replicating Mycobacterium tuberculosis. Bioorg Med Chem19:3956-64 (2011) 
 
L-cysteine:1D-myo-inositol 2-amino-2-deoxy-alpha-D-glucopyranoside ligase
Name:L-cysteine:1D-myo-inositol 2-amino-2-deoxy-alpha-D-glucopyranoside ligase
Type:PROTEIN
Mol. Mass.:45583.42
Organism:Mycobacterium tuberculosis
Description:ChEMBL_754210
Residue:414
BDBM50347261
NameBDBM50347261
Synonyms:CHEMBL1796111
TypeSmall organic molecule
Emp. Form.C28H28ClN3O2S
Mol. Mass.506.059
SMILESClc1cccc(CN2c3cc(ccc3Sc3ccccc3C2=O)C(=O)NCCCN2CCCC2)c1