Reaction Details
TargetL-cysteine:1D-myo-inositol 2-amino-2-deoxy-alpha-D-glucopyranoside ligase
LigandBDBM50347270
Substrate/Competitorn/a
Meas. Tech.ChEMBL_754210 (CHEMBL1798854)
IC50 1700000±n/a nM
Citation Newton, GLBuchmeier, NLa Clair, JJFahey, RC Evaluation of NTF1836 as an inhibitor of the mycothiol biosynthetic enzyme MshC in growing and non-replicating Mycobacterium tuberculosis. Bioorg Med Chem19:3956-64 (2011) 
 
L-cysteine:1D-myo-inositol 2-amino-2-deoxy-alpha-D-glucopyranoside ligase
Name:L-cysteine:1D-myo-inositol 2-amino-2-deoxy-alpha-D-glucopyranoside ligase
Type:PROTEIN
Mol. Mass.:45583.42
Organism:Mycobacterium tuberculosis
Description:ChEMBL_754210
Residue:414
BDBM50347270
NameBDBM50347270
Synonyms:CHEMBL1796120
TypeSmall organic molecule
Emp. Form.C30H33N3O4S
Mol. Mass.531.666
SMILESCC1CCCN(CCCNC(=O)c2ccc3c(c2)N(Cc2ccccc2)C(=O)c2ccccc2S3(=O)=O)C1