Reaction Details
TargetAmine oxidase [flavin-containing] A
LigandBDBM50347304
Substrate/Competitorn/a
Meas. Tech.ChEMBL_754274 (CHEMBL1798961)
Ki 400±n/a nM
Citation Jagrat, MBehera, JYabanoglu, SErcan, AUcar, GSinha, BNSankaran, VBasu, AJayaprakash, V Pyrazoline based MAO inhibitors: synthesis, biological evaluation and SAR studies. Bioorg Med Chem Lett21:4296-300 (2011) 
 
Amine oxidase [flavin-containing] A
Name:Amine oxidase [flavin-containing] A
Type:Protein
Mol. Mass.:59689.53
Organism:Homo sapiens (Human)
Description:P21397
Residue:527
BDBM50347304
NameBDBM50347304
Synonyms:CHEMBL1796459
TypeSmall organic molecule
Emp. Form.C17H18N4
Mol. Mass.278.3516
SMILESCc1ccc(cc1)C1CC(=NN1C(N)=N)c1ccccc1