Reaction Details
TargetLactoylglutathione lyase
LigandBDBM50059989
Substrate/Competitorn/a
Meas. Tech.ChEMBL_754309 (CHEMBL1799085)
Ki 18200±n/a nM
Citation Liu, MYuan, MLi, ZCheng, YKLuo, HBHu, X Structural investigation into the inhibitory mechanisms of indomethacin and its analogues towards human glyoxalase I. Bioorg Med Chem Lett21:4243-7 (2011) 
 
Lactoylglutathione lyase
Name:Lactoylglutathione lyase
Type:Enzyme
Mol. Mass.:20772.95
Organism:Homo sapiens (Human)
Description:Q04760
Residue:184
BDBM50059989
NameBDBM50059989
Synonyms:(1E,4Z,6E)-5-Hydroxy-1,7-bis-(4-hydroxy-phenyl)-hepta-1,4,6-trien-3-one 1,7-bis(4-hydroxyphenyl)-1,6-heptadiene-3,5-dione 5-Hydroxy-1,7-bis(4-hydroxyphenyl)hepta-1,4,6-trien-3-one CHEMBL105350 bis-demethoxycurcumin curcumin III
TypeSmall organic molecule
Emp. Form.C19H16O4
Mol. Mass.308.3279
SMILESOc1ccc(C=CC(=O)CC(=O)C=Cc2ccc(O)cc2)cc1