Reaction Details
TargetcAMP-specific 3',5'-cyclic phosphodiesterase 4B
LigandBDBM50347337
Substrate/Competitorn/a
Meas. Tech.ChEMBL_755118 (CHEMBL1805698)
IC50 0.88±n/a nM
Citation Gallant, MAspiotis, RDay, SDias, RDubé, DDubé, LFriesen, RWGirard, MGuay, DHamel, PHuang, ZLacombe, PLaliberté, SLévesque, JFLiu, SMacdonald, DMancini, JNicholson, DWStyhler, ATownson, KWaters, KYoung, RNGirard, Y Discovery of MK-0952, a selective PDE4 inhibitor for the treatment of long-term memory loss and mild cognitive impairment. Bioorg Med Chem Lett20:6387-93 (2010) 
 
cAMP-specific 3',5'-cyclic phosphodiesterase 4B
Name:cAMP-specific 3',5'-cyclic phosphodiesterase 4B
Type:Protein
Mol. Mass.:83318.87
Organism:Homo sapiens (Human)
Description:Q07343
Residue:736
BDBM50347337
NameBDBM50347337
Synonyms:CHEMBL1801070
TypeSmall organic molecule
Emp. Form.C29H27N3O4
Mol. Mass.481.5424
SMILESCC(C)(Cc1ccc(cc1)-c1cccc(c1)-n1cc(C(=O)NC2CC2)c(=O)c2cccnc12)C(O)=O