Reaction Details
TargetcAMP-specific 3',5'-cyclic phosphodiesterase 4D
LigandBDBM50347335
Substrate/Competitorn/a
Meas. Tech.ChEMBL_755119 (CHEMBL1805699)
IC50 0.54±n/a nM
Citation Gallant, MAspiotis, RDay, SDias, RDubé, DDubé, LFriesen, RWGirard, MGuay, DHamel, PHuang, ZLacombe, PLaliberté, SLévesque, JFLiu, SMacdonald, DMancini, JNicholson, DWStyhler, ATownson, KWaters, KYoung, RNGirard, Y Discovery of MK-0952, a selective PDE4 inhibitor for the treatment of long-term memory loss and mild cognitive impairment. Bioorg Med Chem Lett20:6387-93 (2010) 
 
cAMP-specific 3',5'-cyclic phosphodiesterase 4D
Name:cAMP-specific 3',5'-cyclic phosphodiesterase 4D
Type:Protein
Mol. Mass.:91092.69
Organism:Homo sapiens (Human)
Description:Q08499
Residue:809
BDBM50347335
NameBDBM50347335
Synonyms:CHEMBL1801068
TypeSmall organic molecule
Emp. Form.C28H23N3O4
Mol. Mass.465.4999
SMILESOC(=O)C1CC1c1cccc(c1)-c1cccc(c1)-n1cc(C(=O)NC2CC2)c(=O)c2cccnc12