Reaction Details
TargetcAMP-specific 3',5'-cyclic phosphodiesterase 4D
LigandBDBM50347342
Substrate/Competitorn/a
Meas. Tech.ChEMBL_755119 (CHEMBL1805699)
IC50 0.58±n/a nM
Citation Gallant, MAspiotis, RDay, SDias, RDubé, DDubé, LFriesen, RWGirard, MGuay, DHamel, PHuang, ZLacombe, PLaliberté, SLévesque, JFLiu, SMacdonald, DMancini, JNicholson, DWStyhler, ATownson, KWaters, KYoung, RNGirard, Y Discovery of MK-0952, a selective PDE4 inhibitor for the treatment of long-term memory loss and mild cognitive impairment. Bioorg Med Chem Lett20:6387-93 (2010) 
 
cAMP-specific 3',5'-cyclic phosphodiesterase 4D
Name:cAMP-specific 3',5'-cyclic phosphodiesterase 4D
Type:Protein
Mol. Mass.:91092.69
Organism:Homo sapiens (Human)
Description:Q08499
Residue:809
BDBM50347342
NameBDBM50347342
Synonyms:CHEMBL1801154
TypeSmall organic molecule
Emp. Form.C29H25N3O4
Mol. Mass.479.5265
SMILESCC1(CC1)NC(=O)c1cn(-c2cccc(c2)-c2ccc(cc2)C2CC2C(O)=O)c2ncccc2c1=O