Reaction Details
TargetCannabinoid receptor 1
LigandBDBM50347351
Substrate/Competitorn/a
Meas. Tech.ChEMBL_755296 (CHEMBL1804296)
Ki 0.18±n/a nM
Citation Bodmer-Narkevitch, VAnthony, NJCofre, VJolly, SMMurphy, KLRansom, RWReiss, DRTang, CPrueksaritanont, TPettibone, DJBock, MGKuduk, SD Indazole derivatives as novel bradykinin B1 receptor antagonists. Bioorg Med Chem Lett20:7011-4 (2010) 
 
Cannabinoid receptor 1
Name:Cannabinoid receptor 1
Type:G Protein-Coupled Receptor (GPCR)
Mol. Mass.:52868.96
Organism:Homo sapiens (Human)
Description:P21554
Residue:472
BDBM50347351
NameBDBM50347351
Synonyms:CHEMBL1801352
TypeSmall organic molecule
Emp. Form.C24H20ClFN6O2
Mol. Mass.478.906
SMILESC[C@@H](NC(=O)C1(CC1)NC(=O)c1cncnc1)c1ccc(cc1F)-n1nc(Cl)c2ccccc12