Reaction Details
TargetCannabinoid receptor 1
LigandBDBM50347353
Substrate/Competitorn/a
Meas. Tech.ChEMBL_755296 (CHEMBL1804296)
Ki 1.2±n/a nM
Citation Bodmer-Narkevitch, VAnthony, NJCofre, VJolly, SMMurphy, KLRansom, RWReiss, DRTang, CPrueksaritanont, TPettibone, DJBock, MGKuduk, SD Indazole derivatives as novel bradykinin B1 receptor antagonists. Bioorg Med Chem Lett20:7011-4 (2010) 
 
Cannabinoid receptor 1
Name:Cannabinoid receptor 1
Type:G Protein-Coupled Receptor (GPCR)
Mol. Mass.:52868.96
Organism:Homo sapiens (Human)
Description:P21554
Residue:472
BDBM50347353
NameBDBM50347353
Synonyms:CHEMBL1801354
TypeSmall organic molecule
Emp. Form.C24H19Cl2FN6O2
Mol. Mass.513.351
SMILESC[C@@H](NC(=O)C1(CC1)NC(=O)c1cncc(Cl)n1)c1ccc(cc1F)-n1nc(Cl)c2ccccc12