Reaction Details
TargetCannabinoid receptor 1
LigandBDBM50347359
Substrate/Competitorn/a
Meas. Tech.ChEMBL_755296 (CHEMBL1804296)
Ki 0.81±n/a nM
Citation Bodmer-Narkevitch, VAnthony, NJCofre, VJolly, SMMurphy, KLRansom, RWReiss, DRTang, CPrueksaritanont, TPettibone, DJBock, MGKuduk, SD Indazole derivatives as novel bradykinin B1 receptor antagonists. Bioorg Med Chem Lett20:7011-4 (2010) 
 
Cannabinoid receptor 1
Name:Cannabinoid receptor 1
Type:G Protein-Coupled Receptor (GPCR)
Mol. Mass.:52868.96
Organism:Homo sapiens (Human)
Description:P21554
Residue:472
BDBM50347359
NameBDBM50347359
Synonyms:CHEMBL1801076
TypeSmall organic molecule
Emp. Form.C24H21BrFN5O4
Mol. Mass.542.357
SMILESCOc1cc(on1)C(=O)NC1(CC1)C(=O)N[C@H](C)c1ccc(cc1F)-n1nc(Br)c2ccccc12