Reaction Details
TargetCyclin-H/Cyclin-dependent kinase 7
LigandBDBM50347389
Substrate/Competitorn/a
Meas. Tech.ChEMBL_755648 (CHEMBL1805473)
IC50 21±n/a nM
Citation Heathcote, DAPatel, HKroll, SHHazel, PPeriyasamy, MAlikian, MKanneganti, SKJogalekar, ASScheiper, BBarbazanges, MBlum, ABrackow, JSiwicka, APace, RDFuchter, MJSnyder, JPLiotta, DCFreemont, PSAboagye, EOCoombes, RCBarrett, AGAli, S A novel pyrazolo[1,5-a]pyrimidine is a potent inhibitor of cyclin-dependent protein kinases 1, 2, and 9, which demonstrates antitumor effects in human tumor xenografts following oral administration. J Med Chem53:8508-22 (2010) 
 
Cyclin-H/Cyclin-dependent kinase 7
Name:Cyclin-H/Cyclin-dependent kinase 7
Type:Protein Complex
Mol. Mass.:n/a
Description:n/a
Components:This complex has 2 components.
Component 1
Name:Cyclin-H
Synonyms:CCNH Cyclin H p34 | p37
Type:Enzyme Subunit
Mol. Mass.:37646.05
Organism:Homo sapiens (Human)
Description:n/a
Residue:323
Component 2
Name:Cyclin-dependent kinase 7
Synonyms:39 kDa protein kinase CAK1 CDK-activating kinase 1 (CAK) CDK7_HUMAN Cell division protein kinase 7 Cyclin-dependent kinase 7 (CDK7/cyclin H) P39 Mo15 TFIIH basal transcription factor complex kinase subunit
Type:Enzyme Subunit
Mol. Mass.:39047.01
Organism:Homo sapiens (Human)
Description:n/a
Residue:346
BDBM50347389
NameBDBM50347389
Synonyms:CHEMBL1801932
TypeSmall organic molecule
Emp. Form.C22H32N6
Mol. Mass.380.5297
SMILESCC(C)c1cnn2c(NCc3ccccc3)cc(NCCCCCCN)nc12