Reaction Details
TargetEctonucleotide pyrophosphatase/phosphodiesterase family member 1
LigandBDBM50347447
Substrate/Competitorn/a
Meas. Tech.ChEMBL_755236 (CHEMBL1806215)
Ki 13000±n/a nM
Citation Eliahu, SLecka, JReiser, GHaas, MBigonnesse, FLévesque, SAPelletier, JSévigny, JFischer, B Diadenosine 5',5''-(boranated)polyphosphonate analogues as selective nucleotide pyrophosphatase/phosphodiesterase inhibitors. J Med Chem53:8485-97 (2010) 
 
Ectonucleotide pyrophosphatase/phosphodiesterase family member 1
Name:Ectonucleotide pyrophosphatase/phosphodiesterase family member 1
Type:PROTEIN
Mol. Mass.:104934.43
Organism:Homo sapiens (Human)
Description:ChEMBL_1448940
Residue:925
BDBM50347447
NameBDBM50347447
Synonyms:CHEMBL1802096
TypeSmall organic molecule
Emp. Form.C22H28N10O17P4
Mol. Mass.828.4118
SMILESNc1ncnc2n(cnc12)[C@@H]1O[C@H](COP([O-])(=O)CP([O-])(=O)OP([O-])(=O)CP([O-])(=O)OC[C@H]2O[C@H]([C@H](O)[C@@H]2O)n2cnc3c(N)ncnc23)[C@@H](O)[C@H]1O