Reaction Details
TargetEctonucleotide pyrophosphatase/phosphodiesterase family member 1
LigandBDBM50347448
Substrate/Competitorn/a
Meas. Tech.ChEMBL_755236 (CHEMBL1806215)
Ki 51000±n/a nM
Citation Eliahu, SLecka, JReiser, GHaas, MBigonnesse, FLévesque, SAPelletier, JSévigny, JFischer, B Diadenosine 5',5''-(boranated)polyphosphonate analogues as selective nucleotide pyrophosphatase/phosphodiesterase inhibitors. J Med Chem53:8485-97 (2010) 
 
Ectonucleotide pyrophosphatase/phosphodiesterase family member 1
Name:Ectonucleotide pyrophosphatase/phosphodiesterase family member 1
Type:PROTEIN
Mol. Mass.:104934.43
Organism:Homo sapiens (Human)
Description:ChEMBL_1448940
Residue:925
BDBM50347448
NameBDBM50347448
Synonyms:CHEMBL1802097
TypeSmall organic molecule
Emp. Form.C22H28N10O15P4
Mol. Mass.796.413
SMILESNc1ncnc2n(cnc12)[C@H]1C[C@H](O)[C@@H](COP([O-])(=O)CP([O-])(=O)OP([O-])(=O)CP([O-])(=O)OC[C@H]2O[C@H](C[C@@H]2O)n2cnc3c(N)ncnc23)O1