Reaction Details
TargetRibosyldihydronicotinamide dehydrogenase [quinone]
LigandBDBM50347479
Substrate/Competitorn/a
Meas. Tech.ChEMBL_755664 (CHEMBL1805489)
IC50 4800±n/a nM
Citation Conda-Sheridan, MMarler, LPark, EJKondratyuk, TPJermihov, KMesecar, ADPezzuto, JMAsolkar, RNFenical, WCushman, M Potential chemopreventive agents based on the structure of the lead compound 2-bromo-1-hydroxyphenazine, isolated from Streptomyces species, strain CNS284. J Med Chem53:8688-99 (2010) 
 
Ribosyldihydronicotinamide dehydrogenase [quinone]
Name:Ribosyldihydronicotinamide dehydrogenase [quinone]
Type:Protein
Mol. Mass.:25917.25
Organism:Homo sapiens (Human)
Description:P16083
Residue:231
BDBM50347479
NameBDBM50347479
Synonyms:CHEMBL1802267
TypeSmall organic molecule
Emp. Form.C13H8Cl2N2O
Mol. Mass.279.121
SMILESCOc1cccc2nc3cc(Cl)c(Cl)cc3nc12