Reaction Details
TargetRibosyldihydronicotinamide dehydrogenase [quinone]
LigandBDBM50347472
Substrate/Competitorn/a
Meas. Tech.ChEMBL_755664 (CHEMBL1805489)
IC50 3300±n/a nM
Citation Conda-Sheridan, MMarler, LPark, EJKondratyuk, TPJermihov, KMesecar, ADPezzuto, JMAsolkar, RNFenical, WCushman, M Potential chemopreventive agents based on the structure of the lead compound 2-bromo-1-hydroxyphenazine, isolated from Streptomyces species, strain CNS284. J Med Chem53:8688-99 (2010) 
 
Ribosyldihydronicotinamide dehydrogenase [quinone]
Name:Ribosyldihydronicotinamide dehydrogenase [quinone]
Type:Protein
Mol. Mass.:25917.25
Organism:Homo sapiens (Human)
Description:P16083
Residue:231
BDBM50347472
NameBDBM50347472
Synonyms:CHEMBL1802261
TypeSmall organic molecule
Emp. Form.C12H6Br2N2
Mol. Mass.337.997
SMILESBrc1cc(Br)c2nc3ccccc3nc2c1