Reaction Details
TargetC-X-C chemokine receptor type 4
LigandBDBM50347490
Substrate/Competitorn/a
Meas. Tech.ChEMBL_754437 (CHEMBL1806025)
IC50 0.8±n/a nM
Citation Zhu, AZhan, WLiang, ZYoon, YYang, HGrossniklaus, HEXu, JRojas, MLockwood, MSnyder, JPLiotta, DCShim, H Dipyrimidine amines: a novel class of chemokine receptor type 4 antagonists with high specificity. J Med Chem53:8556-68 (2010) 
 
C-X-C chemokine receptor type 4
Name:C-X-C chemokine receptor type 4
Type:Enzyme
Mol. Mass.:39754.61
Organism:Homo sapiens (Human)
Description:P61073
Residue:352
BDBM50347490
NameBDBM50347490
Synonyms:CHEMBL1802333
TypeSmall organic molecule
Emp. Form.C22H26ClFN8O
Mol. Mass.472.946
SMILESFc1cnc(Cl)nc1NCc1ccc(CNc2ccnc(NCCN3CCOCC3)n2)cc1