Reaction Details
TargetGlycogen synthase kinase-3 beta
LigandBDBM7876
Substrate/Competitorn/a
Meas. Tech.ChEMBL_755831 (CHEMBL1803565)
IC50 500±n/a nM
Citation Perez, DIPalomo, VPérez, CGil, CDans, PDLuque, FJConde, SMartínez, A Switching reversibility to irreversibility in glycogen synthase kinase 3 inhibitors: clues for specific design of new compounds. J Med Chem54:4042-56 (2011) 
 
Glycogen synthase kinase-3 beta
Name:Glycogen synthase kinase-3 beta
Type:Enzyme
Mol. Mass.:46756.38
Organism:Homo sapiens (Human)
Description:P49841
Residue:420
BDBM7876
NameBDBM7876
Synonyms:2-bromo-1-(4-bromophenyl)ethan-1-one p-bromophenacyl bromide
TypeSmall organic molecule
Emp. Form.C8H6Br2O
Mol. Mass.277.941
SMILESBrCC(=O)c1ccc(Br)cc1