Reaction Details
TargetGlycogen synthase kinase-3 beta
LigandBDBM50347531
Substrate/Competitorn/a
Meas. Tech.ChEMBL_755832 (CHEMBL1803566)
IC50 47±n/a nM
Citation Perez, DIPalomo, VPérez, CGil, CDans, PDLuque, FJConde, SMartínez, A Switching reversibility to irreversibility in glycogen synthase kinase 3 inhibitors: clues for specific design of new compounds. J Med Chem54:4042-56 (2011) 
 
Glycogen synthase kinase-3 beta
Name:Glycogen synthase kinase-3 beta
Type:Enzyme
Mol. Mass.:46756.38
Organism:Homo sapiens (Human)
Description:P49841
Residue:420
BDBM50347531
NameBDBM50347531
Synonyms:CHEMBL1801633
TypeSmall organic molecule
Emp. Form.C14H9BrN2O3
Mol. Mass.333.137
SMILESBrCC(=O)C1=C(C(=O)NC1=O)c1c[nH]c2ccccc12