Reaction Details
TargetTranscription factor p65
LigandBDBM50336457
Substrate/Competitorn/a
Meas. Tech.ChEMBL_756042 (CHEMBL1804152)
IC50 250±n/a nM
Citation Ayers, SGraf, TNAdcock, AFKroll, DJMatthew, SCarcache de Blanco, EJShen, QSwanson, SMWani, MCPearce, CJOberlies, NH Resorcylic acid lactones with cytotoxic and NF-¿B inhibitory activities and their structure-activity relationships. J Nat Prod74:1126-31 (2011) 
 
Transcription factor p65
Name:Transcription factor p65
Type:Enzyme
Mol. Mass.:60211.92
Organism:Homo sapiens (Human)
Description:Q04206
Residue:551
BDBM50336457
NameBDBM50336457
Synonyms:(3S,5Z,8S,9R,11E)-8,9,16-trihydroxy-14-methoxy-3-methyl-3,4,9,10-tetrahydro-1H-benzo[c][1]oxacyclotetradecine-1,7(8H)-dione CHEMBL1668411 | CHEMBL1801950
TypeSmall organic molecule
Emp. Form.C19H22O7
Mol. Mass.362.3738
SMILESCOc1cc(O)c2c(CCCC(=O)C(=O)C(=O)CCC[C@H](C)OC2=O)c1