Reaction Details
TargetType-1 angiotensin II receptor
LigandBDBM50347563
Substrate/Competitorn/a
Meas. Tech.ChEMBL_757048 (CHEMBL1803889)
IC50 1.6±n/a nM
Citation Casimiro-Garcia, AFilzen, GFFlynn, DBigge, CFChen, JDavis, JADudley, DAEdmunds, JJEsmaeil, NGeyer, AHeemstra, RJJalaie, MOhren, JFOstroski, REllis, TSchaum, RPStoner, C Discovery of a series of imidazo[4,5-b]pyridines with dual activity at angiotensin II type 1 receptor and peroxisome proliferator-activated receptor-¿. J Med Chem54:4219-33 (2011) 
 
Type-1 angiotensin II receptor
Name:Type-1 angiotensin II receptor
Type:Protein
Mol. Mass.:41080.75
Organism:Homo sapiens (Human)
Description:P30556
Residue:359
BDBM50347563
NameBDBM50347563
Synonyms:CHEMBL1801740
TypeSmall organic molecule
Emp. Form.C29H31N7
Mol. Mass.477.6033
SMILESCCc1nc2c(C)cc(CC(C)C)nc2n1[C@H]1CCc2cc(ccc12)-c1ccccc1-c1nnn[nH]1