Reaction Details
TargetType-1 angiotensin II receptor
LigandBDBM50347573
Substrate/Competitorn/a
Meas. Tech.ChEMBL_757048 (CHEMBL1803889)
IC50 16.9±n/a nM
Citation Casimiro-Garcia, AFilzen, GFFlynn, DBigge, CFChen, JDavis, JADudley, DAEdmunds, JJEsmaeil, NGeyer, AHeemstra, RJJalaie, MOhren, JFOstroski, REllis, TSchaum, RPStoner, C Discovery of a series of imidazo[4,5-b]pyridines with dual activity at angiotensin II type 1 receptor and peroxisome proliferator-activated receptor-¿. J Med Chem54:4219-33 (2011) 
 
Type-1 angiotensin II receptor
Name:Type-1 angiotensin II receptor
Type:Protein
Mol. Mass.:41080.75
Organism:Homo sapiens (Human)
Description:P30556
Residue:359
BDBM50347573
NameBDBM50347573
Synonyms:CHEMBL1801739
TypeSmall organic molecule
Emp. Form.C28H29N7
Mol. Mass.463.5768
SMILESCCc1cc(C)c2nc(C(C)C)n([C@H]3CCc4cc(ccc34)-c3ccccc3-c3nnn[nH]3)c2n1