Reaction Details
TargetRetinol-binding protein 4
LigandBDBM50092055
Substrate/Competitorn/a
Meas. Tech.ChEMBL_756077 (CHEMBL1804187)
EC50 2372±n/a nM
Citation Campos-Sandoval, JARedondo, CKinsella, GKPal, AJones, GEyre, GSHirst, SCFindlay, JB Fenretinide derivatives act as disrupters of interactions of serum retinol binding protein (sRBP) with transthyretin and the sRBP receptor. J Med Chem54:4378-87 (2011) 
 
Retinol-binding protein 4
Name:Retinol-binding protein 4
Type:Protein
Mol. Mass.:23008.75
Organism:Homo sapiens (Human)
Description:P02753
Residue:201
BDBM50092055
NameBDBM50092055
Synonyms:(2E,4E,6E,8E)-3,7-Dimethyl-9-(2,6,6-trimethyl-cyclohex-1-enyl)-nona-2,4,6,8-tetraenoic acid (4-hydroxy-phenyl)-amide 3,7-Dimethyl-9-(2,6,6-trimethyl-cyclohex-1-enyl)-nona-2,4,6,8-tetraenoic acid (4-hydroxy-phenyl)-amide CHEMBL7301 N-(4-HYDROXYPHENYL)ALL-TRANS RETINAMIDE N-(4-hydroxyphenyl)retinamide | N-(4-hydroxyphenyl)retinamide, 4-HPR
TypeSmall organic molecule
Emp. Form.C26H33NO2
Mol. Mass.391.5457
SMILESC\C(\C=C\C1=C(C)CCCC1(C)C)=C/C=C/C(/C)=C/C(=O)Nc1ccc(O)cc1