Reaction Details
TargetEctonucleotide pyrophosphatase/phosphodiesterase family member 2
LigandBDBM50347725
Substrate/Competitorn/a
Meas. Tech.ChEMBL_756213 (CHEMBL1804763)
IC50 55±n/a nM
Citation Albers, HMHendrickx, LJvan Tol, RJHausmann, JPerrakis, AOvaa, H Structure-based design of novel boronic acid-based inhibitors of autotaxin. J Med Chem54:4619-26 (2011) 
 
Ectonucleotide pyrophosphatase/phosphodiesterase family member 2
Name:Ectonucleotide pyrophosphatase/phosphodiesterase family member 2
Type:Enzyme
Mol. Mass.:99007.13
Organism:Homo sapiens (Human)
Description:Q13822
Residue:863
BDBM50347725
NameBDBM50347725
Synonyms:CHEMBL1802520 | CHEMBL1802521
TypeSmall organic molecule
Emp. Form.C25H22BFN2O5
Mol. Mass.460.262
SMILESOB(O)c1ccc(COc2ccc3Cc4c(O)n(Cc5ccc(F)cc5)c(=O)n4Cc3c2)cc1