Reaction Details
TargetEctonucleotide pyrophosphatase/phosphodiesterase family member 2
LigandBDBM50347722
Substrate/Competitorn/a
Meas. Tech.ChEMBL_756213 (CHEMBL1804763)
IC50 5.3±n/a nM
Citation Albers, HMHendrickx, LJvan Tol, RJHausmann, JPerrakis, AOvaa, H Structure-based design of novel boronic acid-based inhibitors of autotaxin. J Med Chem54:4619-26 (2011) 
 
Ectonucleotide pyrophosphatase/phosphodiesterase family member 2
Name:Ectonucleotide pyrophosphatase/phosphodiesterase family member 2
Type:Enzyme
Mol. Mass.:99007.13
Organism:Homo sapiens (Human)
Description:Q13822
Residue:863
BDBM50347722
NameBDBM50347722
Synonyms:CHEMBL1802517
TypeSmall organic molecule
Emp. Form.C25H22BFN2O5
Mol. Mass.460.262
SMILESCN1C(=O)N(Cc2ccc(F)cc2)C(=O)\C1=C/c1ccc(OCc2ccc(cc2)B(O)O)cc1