Reaction Details
TargetDual specificity protein kinase CLK3
LigandBDBM50347748
Substrate/Competitorn/a
Meas. Tech.ChEMBL_756289 (CHEMBL1805102)
IC50 360±n/a nM
Citation Debdab, MCarreaux, FRenault, SSoundararajan, MFedorov, OFilippakopoulos, PLozach, OBabault, LTahtouh, TBaratte, BOgawa, YHagiwara, MEisenreich, ARauch, UKnapp, SMeijer, LBazureau, JP Leucettines, a class of potent inhibitors of cdc2-like kinases and dual specificity, tyrosine phosphorylation regulated kinases derived from the marine sponge leucettamine B: modulation of alternative pre-RNA splicing. J Med Chem54:4172-86 (2011) 
 
Dual specificity protein kinase CLK3
Name:Dual specificity protein kinase CLK3
Type:PROTEIN
Mol. Mass.:73855.32
Organism:Mus musculus
Description:ChEMBL_1502247
Residue:638
BDBM50347748
NameBDBM50347748
Synonyms:CHEMBL1802356
TypeSmall organic molecule
Emp. Form.C18H13N3O5
Mol. Mass.351.3129
SMILESO=C1NC(Nc2ccc3OCOc3c2)=NC1=Cc1ccc2OCOc2c1