Reaction Details
TargetSerine/threonine-protein kinase pim-1
LigandBDBM50347744
Substrate/Competitorn/a
Meas. Tech.ChEMBL_756293 (CHEMBL1805106)
IC50 1500±n/a nM
Citation Debdab, MCarreaux, FRenault, SSoundararajan, MFedorov, OFilippakopoulos, PLozach, OBabault, LTahtouh, TBaratte, BOgawa, YHagiwara, MEisenreich, ARauch, UKnapp, SMeijer, LBazureau, JP Leucettines, a class of potent inhibitors of cdc2-like kinases and dual specificity, tyrosine phosphorylation regulated kinases derived from the marine sponge leucettamine B: modulation of alternative pre-RNA splicing. J Med Chem54:4172-86 (2011) 
 
Serine/threonine-protein kinase pim-1
Name:Serine/threonine-protein kinase pim-1
Type:Protein
Mol. Mass.:35681.82
Organism:Homo sapiens (Human)
Description:P11309
Residue:313
BDBM50347744
NameBDBM50347744
Synonyms:CHEMBL1803083
TypeSmall organic molecule
Emp. Form.C15H15N3O3
Mol. Mass.285.2979
SMILESO=C1NC(NCC2CC2)=NC1=Cc1ccc2OCOc2c1